Reaction Details
TargetMitogen-activated protein kinase 8
LigandBDBM102563
Substrate/Competitorn/a
Meas. Tech.ChEMBL_965783 (CHEMBL2393722)
Kd 0.140000±n/a nM
Citation Gong, LHan, XSilva, TTan, YCGoyal, BTivitmahaisoon, PTrejo, APalmer, WHogg, HJahagir, AAlam, MWagner, PStein, KFilonova, LLoe, BMakra, FRotstein, DRapatova, LDunn, JZuo, FDal Porto, JWong, BJin, SChang, ATran, PHsieh, GNiu, LShao, AReuter, DHermann, JKuglstatter, AGoldstein, D Development of indole/indazole-aminopyrimidines as inhibitors of c-Jun N-terminal kinase (JNK): optimization for JNK potency and physicochemical properties. Bioorg Med Chem Lett23:3565-9 (2013) 
 
Mitogen-activated protein kinase 8
Name:Mitogen-activated protein kinase 8
Type:Enzyme
Mol. Mass.:48297.57
Organism:Homo sapiens (Human)
Description:JNK-1 was purchased from Upstate Cell Signaling Solutions (formerly Upstate Biotechnology).
Residue:427
BDBM102563
NameBDBM102563
Synonyms:US8536172, I-12
TypeSmall organic molecule
Emp. Form.C24H31N5O3S
Mol. Mass.469.6
SMILESCS(=O)(=O)C1CCN(CC1)c1cccc2n(ccc12)-c1ccnc(N[C@H]2CC[C@H](O)CC2)n1