Reaction Details
TargetMitogen-activated protein kinase 9
LigandBDBM102562
Substrate/Competitorn/a
Meas. Tech.ChEMBL_965795 (CHEMBL2393734)
IC50 68±n/a nM
Citation Gong, LHan, XSilva, TTan, YCGoyal, BTivitmahaisoon, PTrejo, APalmer, WHogg, HJahagir, AAlam, MWagner, PStein, KFilonova, LLoe, BMakra, FRotstein, DRapatova, LDunn, JZuo, FDal Porto, JWong, BJin, SChang, ATran, PHsieh, GNiu, LShao, AReuter, DHermann, JKuglstatter, AGoldstein, D Development of indole/indazole-aminopyrimidines as inhibitors of c-Jun N-terminal kinase (JNK): optimization for JNK potency and physicochemical properties. Bioorg Med Chem Lett23:3565-9 (2013) 
 
Mitogen-activated protein kinase 9
Name:Mitogen-activated protein kinase 9
Type:Enzyme
Mol. Mass.:48131.49
Organism:Homo sapiens (Human)
Description:JNK-2 was purchased from Upstate Cell Signaling Solutions (formerly Upstate Biotechnology).
Residue:424
BDBM102562
NameBDBM102562
Synonyms:US8536172, I-11
TypeSmall organic molecule
Emp. Form.C25H33N7O4S
Mol. Mass.527.639
SMILESCS(=O)(=O)N[C@H]1CC[C@@H](CC1)Nc1nccc(n1)-n1ccc2c(cccc12)N1CCN(CC1)C(=O)CO