Reaction Details
TargetAminopeptidase N
LigandBDBM50036967
Substrate/Competitorn/a
Meas. Tech.ChEMBL_35493 (CHEMBL646403)
Ki 12000±n/a nM
Citation Chauvel, ENLlorens-Cortès, CCoric, PWilk, SRoques, BPFournié-Zaluski, MC Differential inhibition of aminopeptidase A and aminopeptidase N by new beta-amino thiols. J Med Chem37:2950-7 (1994) Aminopeptidase N
Name:Aminopeptidase N
Type:Protein
Mol. Mass.:108810.25
Organism:Sus scrofa (Pig)
Description:P15145
Residue:963
BDBM50036967
NameBDBM50036967
Synonyms:(3-Amino-4-mercapto-butyl)-phosphonic acid CHEMBL441816
TypeSmall organic molecule
Emp. Form.C4H12NO3PS
Mol. Mass.185.182
SMILESNC(CS)CCP(O)(O)=O