Reaction Details
TargetGlutamyl aminopeptidase
LigandBDBM50036968
Substrate/Competitorn/a
Meas. Tech.ChEMBL_32829 (CHEMBL646207)
Ki 2000±n/a nM
Citation Chauvel, ENLlorens-Cortès, CCoric, PWilk, SRoques, BPFournié-Zaluski, MC Differential inhibition of aminopeptidase A and aminopeptidase N by new beta-amino thiols. J Med Chem37:2950-7 (1994) Glutamyl aminopeptidase
Name:Glutamyl aminopeptidase
Type:PROTEIN
Mol. Mass.:109226.47
Organism:Homo sapiens (Human)
Description:ChEMBL_32829
Residue:957
BDBM50036968
NameBDBM50036968
Synonyms:(S)-5-Amino-6-mercapto-hexanoic acid hydroxyamide | CHEMBL317189
TypeSmall organic molecule
Emp. Form.C6H14N2O2S
Mol. Mass.178.253
SMILESN[C@H](CS)CCCC(=O)NO