Reaction Details
TargetGlutamyl aminopeptidase
LigandBDBM50036967
Substrate/Competitorn/a
Meas. Tech.ChEMBL_32829 (CHEMBL646207)
Ki 390±n/a nM
Citation Chauvel, ENLlorens-Cortès, CCoric, PWilk, SRoques, BPFournié-Zaluski, MC Differential inhibition of aminopeptidase A and aminopeptidase N by new beta-amino thiols. J Med Chem37:2950-7 (1994) Glutamyl aminopeptidase
Name:Glutamyl aminopeptidase
Type:PROTEIN
Mol. Mass.:109226.47
Organism:Homo sapiens (Human)
Description:ChEMBL_32829
Residue:957
BDBM50036967
NameBDBM50036967
Synonyms:(3-Amino-4-mercapto-butyl)-phosphonic acid CHEMBL441816
TypeSmall organic molecule
Emp. Form.C4H12NO3PS
Mol. Mass.185.182
SMILESNC(CS)CCP(O)(O)=O