Reaction Details
TargetGag-Pol polyprotein [489-587]
LigandBDBM50037537
Substrate/Competitorn/a
Meas. Tech.ChEMBL_159296 (CHEMBL763336)
IC50 0.130000±n/a nM
Citation Dorsey, BDLevin, RBMcDaniel, SLVacca, JPGuare, JPDarke, PLZugay, JAEmini, EASchleif, WAQuintero, JC L-735,524: the design of a potent and orally bioavailable HIV protease inhibitor. J Med Chem37:3443-51 (1994) Gag-Pol polyprotein [489-587]
Name:Gag-Pol polyprotein [489-587]
Type:Enzyme Subunit
Mol. Mass.:10781.16
Organism:Human immunodeficiency virus type 1
Description:P04585[489-587]
Residue:99
BDBM50037537
NameBDBM50037537
Synonyms:(S)-1-[(2S,4R)-2-Hydroxy-4-((R)-(R)-2-hydroxy-indan-1-ylcarbamoyl)-5-phenyl-pentyl]-4-(2-oxo-2H-chromene-3-carbonyl)-piperazine-2-carboxylic acid tert-butylamide | CHEMBL333828
TypeSmall organic molecule
Emp. Form.C40H46N4O7
Mol. Mass.694.8158
SMILESCC(C)(C)NC(=O)[C@@H]1CN(CCN1C[C@@H](O)C[C@@H](Cc1ccccc1)C(=O)NC1[C@H](O)Cc2ccccc12)C(=O)c1cc2ccccc2oc1=O