Reaction Details
TargetGag-Pol polyprotein [489-587]
LigandBDBM636
Substrate/Competitorn/a
Meas. Tech.ChEMBL_159307 (CHEMBL769360)
IC50 5±n/a nM
Citation Kitchin, JBethell, RCCammack, NDolan, SEvans, DNHolman, SHolmes, DSMcMeekin, PMo, CLNieland, N Synthesis and structure-activity relationships of a series of penicillin-derived HIV proteinase inhibitors: heterocyclic ring systems containing P1' and P2' substituents. J Med Chem37:3707-16 (1994) Gag-Pol polyprotein [489-587]
Name:Gag-Pol polyprotein [489-587]
Type:Enzyme Subunit
Mol. Mass.:10781.16
Organism:Human immunodeficiency virus type 1
Description:P04585[489-587]
Residue:99
BDBM636
NameBDBM636
Synonyms:(2R,4S)-2-[(R)-(benzylcarbamoyl)(1-phenylacetamido)methyl]-N-(3-{[(2R,4S)-2-[(R)-(benzylcarbamoyl)(1-phenylacetamido)methyl]-5,5-dimethyl-1,3-thiazolidin-4-yl]formamido}-2-hydroxypropyl)-5,5-dimethyl-1,3-thiazolidine-4-carboxamide Penicillin Et(NH)2 Sym dimer | penicillin deriv. 49
TypeSmall organic molecule
Emp. Form.C49H60N8O7S2
Mol. Mass.937.18
SMILES[H][C@]1(N[C@@H](C(=O)NCC(O)CNC(=O)[C@@H]2N[C@]([H])(SC2(C)C)[C@H](NC(=O)Cc2ccccc2)C(=O)NCc2ccccc2)C(C)(C)S1)[C@H](NC(=O)Cc1ccccc1)C(=O)NCc1ccccc1