Reaction Details
TargetGag-Pol polyprotein [489-587]
LigandBDBM50037828
Substrate/Competitorn/a
Meas. Tech.ChEMBL_159307 (CHEMBL769360)
IC50 86.0±n/a nM
Citation Kitchin, JBethell, RCCammack, NDolan, SEvans, DNHolman, SHolmes, DSMcMeekin, PMo, CLNieland, N Synthesis and structure-activity relationships of a series of penicillin-derived HIV proteinase inhibitors: heterocyclic ring systems containing P1' and P2' substituents. J Med Chem37:3707-16 (1994) Gag-Pol polyprotein [489-587]
Name:Gag-Pol polyprotein [489-587]
Type:Enzyme Subunit
Mol. Mass.:10781.16
Organism:Human immunodeficiency virus type 1
Description:P04585[489-587]
Residue:99
BDBM50037828
NameBDBM50037828
Synonyms:(3S,4aS,8aS)-2-[3-({(2R,4S)-2-[Heptylcarbamoyl-((S)-phenylacetylamino)-methyl]-5,5-dimethyl-thiazolidine-4-carbonyl}-amino)-2-hydroxy-propyl]-decahydro-isoquinoline-3-carboxylic acid tert-butylamide | CHEMBL122031
TypeSmall organic molecule
Emp. Form.C40H66N6O5S
Mol. Mass.743.054
SMILESCCCCCCCNC(=O)C(NC(=O)Cc1ccccc1)[C@@H]1N[C@@H](C(=O)NCC(O)CN2C[C@H]3CCCC[C@H]3C[C@H]2C(=O)NC(C)(C)C)C(C)(C)S1