Reaction Details
TargetGag-Pol polyprotein [489-587]
LigandBDBM50037841
Substrate/Competitorn/a
Meas. Tech.ChEMBL_159307 (CHEMBL769360)
IC50 160±n/a nM
Citation Kitchin, JBethell, RCCammack, NDolan, SEvans, DNHolman, SHolmes, DSMcMeekin, PMo, CLNieland, N Synthesis and structure-activity relationships of a series of penicillin-derived HIV proteinase inhibitors: heterocyclic ring systems containing P1' and P2' substituents. J Med Chem37:3707-16 (1994) Gag-Pol polyprotein [489-587]
Name:Gag-Pol polyprotein [489-587]
Type:Enzyme Subunit
Mol. Mass.:10781.16
Organism:Human immunodeficiency virus type 1
Description:P04585[489-587]
Residue:99
BDBM50037841
NameBDBM50037841
Synonyms:(3S,4aS,8aS)-2-[(R)-3-({(2R,4S)-2-[Benzylcarbamoyl-((S)-phenylacetylamino)-methyl]-5,5-dimethyl-thiazolidine-4-carbonyl}-amino)-2-hydroxy-propyl]-decahydro-isoquinoline-3-carboxylic acid tert-butylamide | CHEMBL333738
TypeSmall organic molecule
Emp. Form.C40H58N6O5S
Mol. Mass.734.991
SMILESCC(C)(C)NC(=O)[C@@H]1C[C@@H]2CCCC[C@@H]2CN1C[C@H](O)CNC(=O)[C@@H]1N[C@H](SC1(C)C)C(NC(=O)Cc1ccccc1)C(=O)NCc1ccccc1