Reaction Details
TargetType-1 angiotensin II receptor
LigandBDBM50038192
Substrate/Competitorn/a
Meas. Tech.ChEMBL_36635 (CHEMBL652346)
IC50 0.270000±n/a nM
Citation Chakravarty, PKNaylor, EMChen, AChang, RSChen, TBFaust, KALotti, VJKivlighn, SDGable, RAZingaro, GJ A highly potent, orally active imidazo[4,5-b]pyridine biphenylacylsulfonamide (MK-996; L-159,282): a new AT1-selective angiotensin II receptor antagonist. J Med Chem37:4068-72 (1995) Type-1 angiotensin II receptor
Name:Type-1 angiotensin II receptor
Type:Enzyme Catalytic Domain
Mol. Mass.:41009.15
Organism:RABBIT
Description:ANGIOTENSIN AT1 AGTR1 RABBIT::P34976
Residue:359
BDBM50038192
NameBDBM50038192
Synonyms:4'-(2-Ethyl-5,7-dimethyl-imidazo[4,5-b]pyridin-3-ylmethyl)-biphenyl-2-sulfonic acid butyryl-amide | CHEMBL131156
TypeSmall organic molecule
Emp. Form.C27H30N4O3S
Mol. Mass.490.617
SMILESCCCC(=O)NS(=O)(=O)c1ccccc1-c1ccc(Cn2c(CC)nc3c(C)cc(C)nc23)cc1