Reaction Details
TargetProthrombin
LigandBDBM50039020
Substrate/Competitorn/a
Meas. Tech.ChEMBL_208860 (CHEMBL810934)
IC50 17600±n/a nM
Citation Iwanowicz, EJLau, WFLin, JRoberts, DGSeiler, SM Retro-binding tripeptide thrombin active-site inhibitors: discovery, synthesis, and molecular modeling. J Med Chem37:2122-4 (1994) Prothrombin
Name:Prothrombin
Type:Protein
Mol. Mass.:70029.57
Organism:Homo sapiens (Human)
Description:P00734
Residue:622
BDBM50039020
NameBDBM50039020
Synonyms:(S)-7-Amino-3-({(S)-1-[(R)-2-(6-amino-hexanoylamino)-3-phenyl-propionyl]-pyrrolidine-2-carbonyl}-amino)-2-hydroxy-heptanoic acid methyl ester | CHEMBL63629
TypeSmall organic molecule
Emp. Form.C28H45N5O6
Mol. Mass.547.6868
SMILESCOC(=O)C(O)[C@H](CCCCN)NC(=O)[C@@H]1CCCN1C(=O)[C@@H](Cc1ccccc1)NC(=O)CCCCCN