Reaction Details
TargetCarboxylic ester hydrolase
LigandBDBM8961
Substrate/Competitorn/a
Meas. Tech.ChEMBL_41588 (CHEMBL654882)
IC50 6±n/a nM
Citation Villalobos, ABlake, JFBiggers, CKButler, TWChapin, DSChen, YLIves, JLJones, SBListon, DRNagel, AA Novel benzisoxazole derivatives as potent and selective inhibitors of acetylcholinesterase. J Med Chem37:2721-34 (1994) Carboxylic ester hydrolase
Name:Carboxylic ester hydrolase
Type:Protein
Mol. Mass.:68842.83
Organism:Equus caballus (Horse)
Description:Q9N1N9
Residue:602
BDBM8961
NameBDBM8961
Synonyms:1,2,3,4-tetrahydro-9-acridinamine 9-THA CHEMBL1337960 Cognex Tracine cid_1935 | tacrine.HCl
TypeSmall organic molecule
Emp. Form.C13H14N2
Mol. Mass.198.2637
SMILESNc1c2CCCCc2nc2ccccc12