Reaction Details
TargetAcetylcholinesterase
LigandBDBM50039720
Substrate/Competitorn/a
Meas. Tech.ChEMBL_28150 (CHEMBL644105)
IC50 120±n/a nM
Citation Villalobos, ABlake, JFBiggers, CKButler, TWChapin, DSChen, YLIves, JLJones, SBListon, DRNagel, AA Novel benzisoxazole derivatives as potent and selective inhibitors of acetylcholinesterase. J Med Chem37:2721-34 (1994) Acetylcholinesterase
Name:Acetylcholinesterase
Type:Enzyme
Mol. Mass.:67792.70
Organism:Homo sapiens (Human)
Description:P22303
Residue:614
BDBM50039720
NameBDBM50039720
Synonyms:3-[2-(1-Benzyl-piperidin-4-yl)-ethyl]-1H-indazole | CHEMBL92958
TypeSmall organic molecule
Emp. Form.C21H25N3
Mol. Mass.319.4433
SMILESC(Cc1n[nH]c2ccccc12)C1CCN(Cc2ccccc2)CC1