Reaction Details
TargetAcetylcholinesterase
LigandBDBM50039721
Substrate/Competitorn/a
Meas. Tech.ChEMBL_28150 (CHEMBL644105)
IC50 0.8±n/a nM
Citation Villalobos, ABlake, JFBiggers, CKButler, TWChapin, DSChen, YLIves, JLJones, SBListon, DRNagel, AA Novel benzisoxazole derivatives as potent and selective inhibitors of acetylcholinesterase. J Med Chem37:2721-34 (1994) Acetylcholinesterase
Name:Acetylcholinesterase
Type:Enzyme
Mol. Mass.:67792.70
Organism:Homo sapiens (Human)
Description:P22303
Residue:614
BDBM50039721
NameBDBM50039721
Synonyms:3-(2-(1-benzylpiperidin-4-yl)ethyl)-6-morpholinobenzo[d]isoxazole CHEMBL93936
TypeSmall organic molecule
Emp. Form.C25H31N3O2
Mol. Mass.405.5325
SMILESC(Cc1noc2cc(ccc12)N1CCOCC1)C1CCN(Cc2ccccc2)CC1