Reaction Details
TargetAdenosine receptor A2a
LigandBDBM21173
Substrate/Competitorn/a
Meas. Tech.ChEMBL_988047 (CHEMBL2438815)
Ki 337±n/a nM
Citation Taliani, STrincavelli, MLCosimelli, BLaneri, SSeveri, EBarresi, EPugliesi, IDaniele, SGiacomelli, CGreco, GNovellino, EMartini, CDa Settimo, F Modulation of A2B adenosine receptor by 1-Benzyl-3-ketoindole derivatives. Eur J Med Chem69:331-7 (2013) 
 
Adenosine receptor A2a
Name:Adenosine receptor A2a
Type:G Protein-Coupled Receptor (GPCR)
Mol. Mass.:44716.46
Organism:Homo sapiens (Human)
Description:P29274
Residue:412
BDBM21173
NameBDBM21173
Synonyms:1,3-dipropyl-8-cyclopentylxanthine CHEMBL183 PD116948 | [3H]DPCPX
Typeradiolabeled ligand
Emp. Form.C16H24N4O2
Mol. Mass.304.3874
SMILESCCCn1c2nc([nH]c2c(=O)n(CCC)c1=O)C1CCCC1