Reaction Details
TargetRetinoic acid receptor RXR-gamma
LigandBDBM50033066
Substrate/Competitorn/a
Meas. Tech.ChEMBL_196648 (CHEMBL800761)
Kd>1000±n/a nM
Citation Boehm, MFZhang, LBadea, BAWhite, SKMais, DEBerger, ESuto, CMGoldman, MEHeyman, RA Synthesis and structure-activity relationships of novel retinoid X receptor-selective retinoids. J Med Chem37:2930-41 (1994) Retinoic acid receptor RXR-gamma
Name:Retinoic acid receptor RXR-gamma
Type:PROTEIN
Mol. Mass.:50900.28
Organism:Mus musculus
Description:ChEMBL_196589
Residue:463
BDBM50033066
NameBDBM50033066
Synonyms:4-(5,5,8,8-Tetramethyl-5,6,7,8-tetrahydro-naphthalene-2-carbonyl)-benzoic acid | CHEMBL101308
TypeSmall organic molecule
Emp. Form.C22H24O3
Mol. Mass.336.4242
SMILESCC1(C)CCC(C)(C)c2cc(ccc12)C(=O)c1ccc(cc1)C(O)=O