Reaction Details
TargetE3 ubiquitin-protein ligase XIAP
LigandBDBM50495451
Substrate/Competitorn/a
Meas. Tech.ChEMBL_1287140 (CHEMBL3111929)
IC50 15±n/a nM
Citation Hennessy, EJAdam, AAquila, BMCastriotta, LMCook, DHattersley, MHird, AWHuntington, CKamhi, VMLaing, NMLi, DMacIntyre, TOmer, CAOza, VPatterson, TRepik, GRooney, MTSaeh, JCSha, LVasbinder, MMWang, HWhitston, D Discovery of a novel class of dimeric Smac mimetics as potent IAP antagonists resulting in a clinical candidate for the treatment of cancer (AZD5582). J Med Chem56:9897-919 (2013) 
 
E3 ubiquitin-protein ligase XIAP
Name:E3 ubiquitin-protein ligase XIAP
Type:Protein
Mol. Mass.:56685.27
Organism:Homo sapiens (Human)
Description:P98170
Residue:497
BDBM50495451
NameBDBM50495451
Synonyms:CHEMBL3108827
TypeSmall organic molecule
Emp. Form.C58H78N8O8
Mol. Mass.1015.2887
SMILESCN[C@@H](C)C(=O)N[C@@H](C1CCCCC1)C(=O)N1CCC[C@H]1C(=O)N[C@@H]1[C@@H](Cc2ccccc12)OCC#CC#CCO[C@@H]1Cc2ccccc2[C@@H]1NC(=O)[C@@H]1CCCN1C(=O)[C@@H](NC(=O)[C@H](C)NC)C1CCCCC1