Reaction Details
TargetBaculoviral IAP repeat-containing protein 2
LigandBDBM50495454
Substrate/Competitorn/a
Meas. Tech.ChEMBL_1287141 (CHEMBL3112066)
IC50 10.0±n/a nM
Citation Hennessy, EJAdam, AAquila, BMCastriotta, LMCook, DHattersley, MHird, AWHuntington, CKamhi, VMLaing, NMLi, DMacIntyre, TOmer, CAOza, VPatterson, TRepik, GRooney, MTSaeh, JCSha, LVasbinder, MMWang, HWhitston, D Discovery of a novel class of dimeric Smac mimetics as potent IAP antagonists resulting in a clinical candidate for the treatment of cancer (AZD5582). J Med Chem56:9897-919 (2013) 
 
Baculoviral IAP repeat-containing protein 2
Name:Baculoviral IAP repeat-containing protein 2
Type:Protein
Mol. Mass.:69900.47
Organism:Homo sapiens (Human)
Description:Q13490
Residue:618
BDBM50495454
NameBDBM50495454
Synonyms:CHEMBL3108923
TypeSmall organic molecule
Emp. Form.C28H40N4O4
Mol. Mass.496.6416
SMILESCN[C@@H](C)C(=O)N[C@H](C(=O)N1CCC[C@H]1C(=O)N[C@@H]1[C@@H](CCc2ccccc12)OCC#C)C(C)(C)C