Reaction Details
TargetTransmembrane prolyl 4-hydroxylase
LigandBDBM26114
Substrate/Competitorn/a
Meas. Tech.ChEBML_223465
IC50 5180±n/a nM
Citation Hales, NJBeattie, JF Novel inhibitors of prolyl 4-hydroxylase. 5. The intriguing structure-activity relationships seen with 2,2'-bipyridine and its 5,5'-dicarboxylic acid derivatives. J Med Chem36:3853-8 (1994) Transmembrane prolyl 4-hydroxylase
Name:Transmembrane prolyl 4-hydroxylase
Type:Enzyme
Mol. Mass.:56654.25
Organism:Homo sapiens (Human)
Description:Q9NXG6
Residue:502
BDBM26114
NameBDBM26114
Synonyms:CHEMBL88972 pyridine-2,5-dicarboxylic acid
TypeSmall organic molecule
Emp. Form.C7H5NO4
Mol. Mass.167.1189
SMILESOC(=O)c1ccc(nc1)C(O)=O