Reaction Details
TargetDihydrofolate reductase
LigandBDBM50016325
Substrate/Competitorn/a
Meas. Tech.ChEMBL_52831 (CHEMBL665037)
IC50 0.000530±n/a nM
Citation Piper, JRJohnson, CAMaddry, JAMalik, NDMcGuire, JJOtter, GMSirotnak, FM Studies on analogues of classical antifolates bearing the naphthoyl group in place of benzoyl in the side chain. J Med Chem36:4161-71 (1994) Dihydrofolate reductase
Name:Dihydrofolate reductase
Type:Enzyme
Mol. Mass.:23891.29
Organism:Pneumocystis carinii
Description:n/a
Residue:206
BDBM50016325
NameBDBM50016325
Synonyms:2-{4-[(2,4-Diamino-pyrido[2,3-d]pyrimidin-6-ylmethyl)-amino]-benzoylamino}-pentanedioic acid | CHEMBL275309
TypeSmall organic molecule
Emp. Form.C20H21N7O5
Mol. Mass.439.4246
SMILESNc1nc(N)c2cc(CNc3ccc(cc3)C(=O)NC(CCC(O)=O)C(O)=O)cnc2n1