Reaction Details
TargetType-1 angiotensin II receptor
LigandBDBM50043463
Substrate/Competitorn/a
Meas. Tech.ChEMBL_36940 (CHEMBL648843)
IC50 0.900000±n/a nM
Citation Dhanoa, DSBagley, SWChang, RSLotti, VJChen, TBKivlighn, SDZingaro, GJSiegl, PKPatchett, AAGreenlee, WJ Non-peptide angiotensin II receptor antagonists. 2. Design, synthesis, and biological activity of N-substituted (phenylamino)phenylacetic acids and acyl sulfonamides. J Med Chem36:4239-49 (1994) Type-1 angiotensin II receptor
Name:Type-1 angiotensin II receptor
Type:Enzyme Catalytic Domain
Mol. Mass.:41009.15
Organism:RABBIT
Description:ANGIOTENSIN AT1 AGTR1 RABBIT::P34976
Residue:359
BDBM50043463
NameBDBM50043463
Synonyms:CHEMBL337007 | N-(2-{Ethyl-[4-(2-ethyl-5,7-dimethyl-imidazo[4,5-b]pyridin-3-ylmethyl)-phenyl]-amino}-2-phenyl-acetyl)-benzenesulfonamide
TypeSmall organic molecule
Emp. Form.C33H35N5O3S
Mol. Mass.581.728
SMILESCCN(C(C(=O)NS(=O)(=O)c1ccccc1)c1ccccc1)c1ccc(Cn2c(CC)nc3c(C)cc(C)nc23)cc1