Reaction Details
TargetType-1 angiotensin II receptor B
LigandBDBM50044342
Substrate/Competitorn/a
Meas. Tech.ChEBML_34826
IC50 25±n/a nM
Citation Huang, HCReitz, DBChamberlain, TSOlins, GMCorpus, VMMcMahon, EGPalomo, MAKoepke, JPSmits, GJMcGraw, DE Synthesis and structure-activity relationships of nonpeptide, potent triazolone-based angiotensin II receptor antagonists. J Med Chem36:2172-81 (1993) Type-1 angiotensin II receptor B
Name:Type-1 angiotensin II receptor B
Type:Enzyme Catalytic Domain
Mol. Mass.:40929.44
Organism:RAT
Description:Angiotensin II AT1B 0 RAT::P29089
Residue:359
BDBM50044342
NameBDBM50044342
Synonyms:2-(2-Adamantan-1-yl-2-oxo-ethyl)-5-butyl-4-[2'-(1H-tetrazol-5-yl)-biphenyl-4-ylmethyl]-2,4-dihydro-[1,2,4]triazol-3-one | CHEMBL302478
TypeSmall organic molecule
Emp. Form.C32H37N7O2
Mol. Mass.551.6819
SMILESCCCCc1nn(CC(=O)C23C[C@H]4C[C@H](C[C@H](C4)C2)C3)c(=O)n1Cc1ccc(cc1)-c1ccccc1-c1nnn[nH]1