Reaction Details
TargetKappa-type opioid receptor
LigandBDBM50045748
Substrate/Competitorn/a
Meas. Tech.ChEMBL_220932 (CHEMBL874095)
Ki 54±n/a nM
Citation Zimmerman, DMLeander, JDCantrell, BEReel, JKSnoddy, JMendelsohn, LGJohnson, BGMitch, CH Structure-activity relationships of trans-3,4-dimethyl-4-(3-hydroxyphenyl)piperidine antagonists for mu- and kappa-opioid receptors. J Med Chem36:2833-41 (1993) Kappa-type opioid receptor
Name:Kappa-type opioid receptor
Type:G Protein-Coupled Receptor (GPCR)
Mol. Mass.:42744.99
Organism:Cavia porcellus (domestic guinea pig)
Description:P41144
Residue:380
BDBM50045748
NameBDBM50045748
Synonyms:3-{1-[2-(3-Chloro-phenyl)-ethyl]-3,4-dimethyl-piperidin-4-yl}-phenol | CHEMBL97767
TypeSmall organic molecule
Emp. Form.C21H26ClNO
Mol. Mass.343.89
SMILESC[C@H]1CN(CCc2cccc(Cl)c2)CC[C@@]1(C)c1cccc(O)c1