Reaction Details
TargetMu-type opioid receptor
LigandBDBM50045755
Substrate/Competitorn/a
Meas. Tech.ChEBML_222070
Ki 1.3±n/a nM
Citation Zimmerman, DMLeander, JDCantrell, BEReel, JKSnoddy, JMendelsohn, LGJohnson, BGMitch, CH Structure-activity relationships of trans-3,4-dimethyl-4-(3-hydroxyphenyl)piperidine antagonists for mu- and kappa-opioid receptors. J Med Chem36:2833-41 (1993) Mu-type opioid receptor
Name:Mu-type opioid receptor
Type:G Protein-Coupled Receptor (GPCR)
Mol. Mass.:44503.11
Organism:Rattus norvegicus (rat)
Description:Competition binding assays were carried out using membrane preparations from transfected HN9.10 cells that constitutively expressed the mu opioid receptor.
Residue:398
BDBM50045755
NameBDBM50045755
Synonyms:3-[3,4-Dimethyl-1-(2-phenoxy-ethyl)-piperidin-4-yl]-phenol | CHEMBL95527
TypeSmall organic molecule
Emp. Form.C21H27NO2
Mol. Mass.325.4446
SMILESC[C@H]1CN(CCOc2ccccc2)CC[C@@]1(C)c1cccc(O)c1