Reaction Details
TargetKappa-type opioid receptor
LigandBDBM50045786
Substrate/Competitorn/a
Meas. Tech.ChEBML_220942
Ki 5.5±n/a nM
Citation Mitch, CHLeander, JDMendelsohn, LGShaw, WNWong, DTCantrell, BEJohnson, BGReel, JKSnoddy, JDTakemori, AE 3,4-Dimethyl-4-(3-hydroxyphenyl)piperidines: opioid antagonists with potent anorectant activity. J Med Chem36:2842-50 (1993) Kappa-type opioid receptor
Name:Kappa-type opioid receptor
Type:G Protein-Coupled Receptor (GPCR)
Mol. Mass.:42744.99
Organism:Cavia porcellus (domestic guinea pig)
Description:P41144
Residue:380
BDBM50045786
NameBDBM50045786
Synonyms:3-[1-(3-Cyclopentyl-3-hydroxy-propyl)-3,4-dimethyl-piperidin-4-yl]-phenol | CHEMBL317756
TypeSmall organic molecule
Emp. Form.C21H33NO2
Mol. Mass.331.4922
SMILESC[C@H]1CN(CCC(O)C2CCCC2)CC[C@@]1(C)c1cccc(O)c1