Reaction Details
TargetKappa-type opioid receptor
LigandBDBM50045781
Substrate/Competitorn/a
Meas. Tech.ChEBML_220942
Ki 3.9±n/a nM
Citation Mitch, CHLeander, JDMendelsohn, LGShaw, WNWong, DTCantrell, BEJohnson, BGReel, JKSnoddy, JDTakemori, AE 3,4-Dimethyl-4-(3-hydroxyphenyl)piperidines: opioid antagonists with potent anorectant activity. J Med Chem36:2842-50 (1993) Kappa-type opioid receptor
Name:Kappa-type opioid receptor
Type:G Protein-Coupled Receptor (GPCR)
Mol. Mass.:42744.99
Organism:Cavia porcellus (domestic guinea pig)
Description:P41144
Residue:380
BDBM50045781
NameBDBM50045781
Synonyms:1-Cyclohexyl-3-[4-(3-hydroxy-phenyl)-3,4-dimethyl-piperidin-1-yl]-propan-1-one | CHEMBL96776
TypeSmall organic molecule
Emp. Form.C22H33NO2
Mol. Mass.343.5029
SMILESC[C@H]1CN(CCC(=O)C2CCCCC2)CC[C@@]1(C)c1cccc(O)c1