Reaction Details
TargetMu-type opioid receptor
LigandBDBM50045779
Substrate/Competitorn/a
Meas. Tech.ChEBML_220391
Ki 0.290000±n/a nM
Citation Mitch, CHLeander, JDMendelsohn, LGShaw, WNWong, DTCantrell, BEJohnson, BGReel, JKSnoddy, JDTakemori, AE 3,4-Dimethyl-4-(3-hydroxyphenyl)piperidines: opioid antagonists with potent anorectant activity. J Med Chem36:2842-50 (1993) Mu-type opioid receptor
Name:Mu-type opioid receptor
Type:G Protein-Coupled Receptor (GPCR)
Mol. Mass.:44503.11
Organism:Rattus norvegicus (rat)
Description:Competition binding assays were carried out using membrane preparations from transfected HN9.10 cells that constitutively expressed the mu opioid receptor.
Residue:398
BDBM50045779
NameBDBM50045779
Synonyms:3-[3,4-Dimethyl-1-(4-methyl-pentyl)-piperidin-4-yl]-phenol | CHEMBL97223
TypeSmall organic molecule
Emp. Form.C19H31NO
Mol. Mass.289.4555
SMILESCC(C)CCCN1CC[C@](C)([C@@H](C)C1)c1cccc(O)c1