Reaction Details
TargetType-1 angiotensin II receptor B
LigandBDBM50046078
Substrate/Competitorn/a
Meas. Tech.ChEBML_34803
IC50 6.5±n/a nM
Citation Bovy, PRReitz, DBCollins, JTChamberlain, TSOlins, GMCorpus, VMMcMahon, EGPalomo, MAKoepke, JPSmits, GJ Nonpeptide angiotensin II antagonists: N-phenyl-1H-pyrrole derivatives are angiotensin II receptor antagonists. J Med Chem36:101-10 (1993) Type-1 angiotensin II receptor B
Name:Type-1 angiotensin II receptor B
Type:Enzyme Catalytic Domain
Mol. Mass.:40929.44
Organism:RAT
Description:Angiotensin II AT1B 0 RAT::P29089
Residue:359
BDBM50046078
NameBDBM50046078
Synonyms:5-[4'-(3,5-Dibutyl-[1,2,4]triazol-1-ylmethyl)-biphenyl-2-yl]-1H-tetrazole CHEMBL85595 | SC-50560
TypeSmall organic molecule
Emp. Form.C24H29N7
Mol. Mass.415.534
SMILESCCCCc1nc(CCCC)n(Cc2ccc(cc2)-c2ccccc2-c2nnn[nH]2)n1