Reaction Details
TargetCarnitine O-palmitoyltransferase 1, liver isoform
LigandBDBM50046145
Substrate/Competitorn/a
Meas. Tech.ChEBML_46327
Ki 4200±n/a nM
Citation Gandour, RDLeung, OTGreway, ATRamsay, RRNic a'Bháird, NFronczek, FRBellard, BMKumaravel, G (+)-Hemipalmitoylcarnitinium strongly inhibits carnitine palmitoyltransferase-I in intact mitochondria. J Med Chem36:237-42 (1993) Carnitine O-palmitoyltransferase 1, liver isoform
Name:Carnitine O-palmitoyltransferase 1, liver isoform
Type:PROTEIN
Mol. Mass.:88147.11
Organism:Rattus norvegicus
Description:ChEMBL_887445
Residue:773
BDBM50046145
NameBDBM50046145
Synonyms:2-[6-hydroxy-4,4-dimethyl-6-pentadecyl-(2R,6S)-1,4-oxazinan-4-ium-2-yl]acetate(hemipalmitoylcarnitinium (HPC)) CHEMBL48257 | Hemiacylcarnitinium(+)-HPC
TypeSmall organic molecule
Emp. Form.C23H45NO4
Mol. Mass.399.6077
[C@@]1(O)C[N+](C)(C)C[C@@H](CC([O-])=O)O1