Reaction Details
TargetThymidylate kinase
LigandBDBM50498055
Substrate/Competitorn/a
Meas. Tech.ChEMBL_1461346 (CHEMBL3396196)
IC50 3600±n/a nM
Citation Naik, MRaichurkar, ABandodkar, BSVarun, BVBhat, SKalkhambkar, RMurugan, KMenon, RBhat, JPaul, BIyer, HHussein, STucker, JAVogtherr, MEmbrey, KJMcMiken, HPrasad, SGill, AUgarkar, BGVenkatraman, JRead, JPanda, M Structure guided lead generation for M. tuberculosis thymidylate kinase (Mtb TMK): discovery of 3-cyanopyridone and 1,6-naphthyridin-2-one as potent inhibitors. J Med Chem58:753-66 (2015) 
 
Thymidylate kinase
Name:Thymidylate kinase
Type:PROTEIN
Mol. Mass.:22636.29
Organism:Mycobacterium tuberculosis
Description:ChEMBL_208218
Residue:214
BDBM50498055
NameBDBM50498055
Synonyms:CHEMBL3394145
TypeSmall organic molecule
Emp. Form.C11H8N2OS2
Mol. Mass.248.324
SMILESCSc1cc([nH]c(=O)c1C#N)-c1cccs1