Reaction Details
TargetThymidylate kinase
LigandBDBM50498072
Substrate/Competitorn/a
Meas. Tech.ChEMBL_1461346 (CHEMBL3396196)
IC50 8000±n/a nM
Citation Naik, MRaichurkar, ABandodkar, BSVarun, BVBhat, SKalkhambkar, RMurugan, KMenon, RBhat, JPaul, BIyer, HHussein, STucker, JAVogtherr, MEmbrey, KJMcMiken, HPrasad, SGill, AUgarkar, BGVenkatraman, JRead, JPanda, M Structure guided lead generation for M. tuberculosis thymidylate kinase (Mtb TMK): discovery of 3-cyanopyridone and 1,6-naphthyridin-2-one as potent inhibitors. J Med Chem58:753-66 (2015) 
 
Thymidylate kinase
Name:Thymidylate kinase
Type:PROTEIN
Mol. Mass.:22636.29
Organism:Mycobacterium tuberculosis
Description:ChEMBL_208218
Residue:214
BDBM50498072
NameBDBM50498072
Synonyms:CHEMBL3394158
TypeSmall organic molecule
Emp. Form.C13H11N3O2S
Mol. Mass.273.31
SMILESCOc1cccc(c1)-c1nc(SC)c(C#N)c(=O)[nH]1