Reaction Details
TargetRenin
LigandBDBM50011228
Substrate/Competitorn/a
Meas. Tech.ChEMBL_195746 (CHEMBL801598)
pH7.4±n/a
IC50 1.3±n/a nM
Commentsextracted
Citation Rosenberg, SHSpina, KPWoods, KWPolakowski, JMartin, DLYao, ZStein, HHCohen, JBarlow, JLEgan, DA Studies directed toward the design of orally active renin inhibitors. 1. Some factors influencing the absorption of small peptides. J Med Chem36:449-59 (1993) Renin
Name:Renin
Type:Enzyme
Mol. Mass.:45058.99
Organism:Homo sapiens (Human)
Description:n/a
Residue:406
BDBM50011228
NameBDBM50011228
Synonyms:(R)-2-Benzyl-N-[(S)-1-[(1S,2R)-1-cyclohexylmethyl-2-((S)-3-ethyl-2-oxo-oxazolidin-5-yl)-2-hydroxy-ethylcarbamoyl]-2-(3H-imidazol-4-yl)-ethyl]-4-morpholin-4-yl-4-oxo-butyramide CHEMBL345043
TypeSmall organic molecule
Emp. Form.C35H50N6O7
Mol. Mass.666.8075
SMILESCCN1C[C@H](OC1=O)[C@H](O)[C@H](CC1CCCCC1)NC(=O)[C@H](Cc1cnc[nH]1)NC(=O)[C@@H](CC(=O)N1CCOCC1)Cc1ccccc1