Reaction Details
TargetLysine-specific demethylase 4E
LigandBDBM26113
Substrate/Competitorn/a
Meas. Tech.ChEMBL_1519856 (CHEMBL3624699)
IC50 6310±n/a nM
Citation England, KSTumber, AKrojer, TScozzafava, GNg, SSDaniel, MSzykowska, AChe, Kvon Delft, FBurgess-Brown, NAKawamura, ASchofield, CJBrennan, PE Optimisation of a triazolopyridine based histone demethylase inhibitor yields a potent and selective KDM2A (FBXL11) inhibitor. Medchemcomm5:1879-1886 (2014) 
 
Lysine-specific demethylase 4E
Name:Lysine-specific demethylase 4E
Type:Enzyme
Mol. Mass.:56815.71
Organism:Homo sapiens (Human)
Description:B2RXH2
Residue:506
BDBM26113
NameBDBM26113
Synonyms:2,4 PDCA pyridine carboxylate, 6a | pyridine-2,4-dicarboxylic acid
TypeSmall organic molecule
Emp. Form.C7H5NO4
Mol. Mass.167.1189
SMILESOC(=O)c1ccnc(c1)C(O)=O