Reaction Details
TargetLysine-specific demethylase 5C
LigandBDBM26113
Substrate/Competitorn/a
Meas. Tech.ChEMBL_1519870 (CHEMBL3624713)
IC50 501±n/a nM
Citation England, KSTumber, AKrojer, TScozzafava, GNg, SSDaniel, MSzykowska, AChe, Kvon Delft, FBurgess-Brown, NAKawamura, ASchofield, CJBrennan, PE Optimisation of a triazolopyridine based histone demethylase inhibitor yields a potent and selective KDM2A (FBXL11) inhibitor. Medchemcomm5:1879-1886 (2014) 
 
Lysine-specific demethylase 5C
Name:Lysine-specific demethylase 5C
Type:PROTEIN
Mol. Mass.:175691.17
Organism:Homo sapiens (Human)
Description:P41229
Residue:1560
BDBM26113
NameBDBM26113
Synonyms:2,4 PDCA pyridine carboxylate, 6a | pyridine-2,4-dicarboxylic acid
TypeSmall organic molecule
Emp. Form.C7H5NO4
Mol. Mass.167.1189
SMILESOC(=O)c1ccnc(c1)C(O)=O