Reaction Details
TargetAcetylcholinesterase
LigandBDBM50499519
Substrate/Competitorn/a
Meas. Tech.ChEMBL_1541912 (CHEMBL3743391)
IC50 870±n/a nM
Citation Di Pietro, OVicente-García, ETaylor, MCBerenguer, DViayna, ELanzoni, ASola, ISayago, HRiera, CFisa, RClos, MVPérez, BKelly, JMLavilla, RMuñoz-Torrero, D Multicomponent reaction-based synthesis and biological evaluation of tricyclic heterofused quinolines with multi-trypanosomatid activity. Eur J Med Chem105:120-37 (2015) 
 
Acetylcholinesterase
Name:Acetylcholinesterase
Type:Enzyme
Mol. Mass.:71812.79
Organism:Electrophorus electricus (Electric eel)
Description:n/a
Residue:633
BDBM50499519
NameBDBM50499519
Synonyms:CHEMBL3740980
TypeSmall organic molecule
Emp. Form.C18H16ClN3
Mol. Mass.309.793
SMILESNCc1ccc(cc1)-c1nc2ccc(Cl)cc2c2NCCc12