Reaction Details
TargetEpidermal growth factor receptor
LigandBDBM50500088
Substrate/Competitorn/a
Meas. Tech.ChEMBL_1541778 (CHEMBL3745460)
IC50 8.4±n/a nM
Citation Zuo, SJZhang, SMao, SXie, XXXiao, XXin, MHXuan, WHe, YYCao, YXZhang, SQ Combination of 4-anilinoquinazoline, arylurea and tertiary amine moiety to discover novel anticancer agents. Bioorg Med Chem24:179-90 (2016) 
 
Epidermal growth factor receptor
Name:Epidermal growth factor receptor
Type:Receptor Kinase Domain
Mol. Mass.:134279.59
Organism:Homo sapiens (Human)
Description:P00533
Residue:1210
BDBM50500088
NameBDBM50500088
Synonyms:CHEMBL3740144
TypeSmall organic molecule
Emp. Form.C34H33ClFN7O2
Mol. Mass.626.123
SMILESCN1CCN(Cc2ccc(NC(=O)Nc3ccc4ncnc(Nc5ccc(OCc6cccc(F)c6)c(Cl)c5)c4c3)cc2)CC1