Reaction Details
TargetVascular endothelial growth factor receptor 2
LigandBDBM50500089
Substrate/Competitorn/a
Meas. Tech.ChEMBL_1541780 (CHEMBL3745462)
IC50 565±n/a nM
Citation Zuo, SJZhang, SMao, SXie, XXXiao, XXin, MHXuan, WHe, YYCao, YXZhang, SQ Combination of 4-anilinoquinazoline, arylurea and tertiary amine moiety to discover novel anticancer agents. Bioorg Med Chem24:179-90 (2016) 
 
Vascular endothelial growth factor receptor 2
Name:Vascular endothelial growth factor receptor 2
Type:Receptor Tyrosine Kinase
Mol. Mass.:151510.97
Organism:Homo sapiens (Human)
Description:P35968
Residue:1356
BDBM50500089
NameBDBM50500089
Synonyms:CHEMBL3740910
TypeSmall organic molecule
Emp. Form.C27H25F3N6O
Mol. Mass.506.5222
SMILESFC(F)(F)c1cccc(Nc2ncnc3ccc(NC(=O)Nc4ccc(CN5CCCC5)cc4)cc23)c1