Reaction Details
TargetEpidermal growth factor receptor
LigandBDBM50500089
Substrate/Competitorn/a
Meas. Tech.ChEMBL_1541778 (CHEMBL3745460)
IC50 4.1±n/a nM
Citation Zuo, SJZhang, SMao, SXie, XXXiao, XXin, MHXuan, WHe, YYCao, YXZhang, SQ Combination of 4-anilinoquinazoline, arylurea and tertiary amine moiety to discover novel anticancer agents. Bioorg Med Chem24:179-90 (2016) 
 
Epidermal growth factor receptor
Name:Epidermal growth factor receptor
Type:Receptor Kinase Domain
Mol. Mass.:134279.59
Organism:Homo sapiens (Human)
Description:P00533
Residue:1210
BDBM50500089
NameBDBM50500089
Synonyms:CHEMBL3740910
TypeSmall organic molecule
Emp. Form.C27H25F3N6O
Mol. Mass.506.5222
SMILESFC(F)(F)c1cccc(Nc2ncnc3ccc(NC(=O)Nc4ccc(CN5CCCC5)cc4)cc23)c1