Reaction Details
TargetEpidermal growth factor receptor
LigandBDBM50500090
Substrate/Competitorn/a
Meas. Tech.ChEMBL_1541778 (CHEMBL3745460)
IC50 5.0±n/a nM
Citation Zuo, SJZhang, SMao, SXie, XXXiao, XXin, MHXuan, WHe, YYCao, YXZhang, SQ Combination of 4-anilinoquinazoline, arylurea and tertiary amine moiety to discover novel anticancer agents. Bioorg Med Chem24:179-90 (2016) 
 
Epidermal growth factor receptor
Name:Epidermal growth factor receptor
Type:Receptor Kinase Domain
Mol. Mass.:134279.59
Organism:Homo sapiens (Human)
Description:P00533
Residue:1210
BDBM50500090
NameBDBM50500090
Synonyms:CHEMBL3741473
TypeSmall organic molecule
Emp. Form.C28H27F3N6O
Mol. Mass.520.5488
SMILESFC(F)(F)c1cccc(Nc2ncnc3ccc(NC(=O)Nc4ccc(CN5CCCCC5)cc4)cc23)c1