Reaction Details
TargetProstaglandin G/H synthase 2
LigandBDBM50049644
Substrate/Competitorn/a
Meas. Tech.ChEMBL_159753 (CHEMBL762917)
IC50 2±n/a nM
Citation Li, JJNorton, MBReinhard, EJAnderson, GDGregory, SAIsakson, PCKoboldt, CMMasferrer, JLPerkins, WESeibert, KZhang, YZweifel, BSReitz, DB Novel terphenyls as selective cyclooxygenase-2 inhibitors and orally active anti-inflammatory agents. J Med Chem39:1846-56 (1996) 
 
Prostaglandin G/H synthase 2
Name:Prostaglandin G/H synthase 2
Type:Enzyme
Mol. Mass.:69003.89
Organism:Homo sapiens (Human)
Description:Recombinant Cox-2 provided by Cayman (Cayman Chemical Co.,Ann Arbor, MI).
Residue:604
BDBM50049644
NameBDBM50049644
Synonyms:4,4',5'-Trifluoro-3-methyl-[1,1';2',1'']terphenyl-4''-sulfonic acid amide | CHEMBL52020
TypeSmall organic molecule
Emp. Form.C19H14F3NO2S
Mol. Mass.377.38
SMILESCc1cc(ccc1F)-c1cc(F)c(F)cc1-c1ccc(cc1)S(N)(=O)=O