Reaction Details
TargetGastrin/cholecystokinin type B receptor
LigandBDBM50049805
Substrate/Competitorn/a
Meas. Tech.ChEMBL_48098 (CHEMBL663085)
Ki>100000±n/a nM
Citation Cappelli, AAnzini, MVomero, SMenziani, MCDe Benedetti, PGSbacchi, MClarke, GDMennuni, L Synthesis, biological evaluation, and quantitative receptor docking simulations of 2-[(acylamino)ethyl]-1,4-benzodiazepines as novel tifluadom-like ligands with high affinity and selectivity for kappa-opioid receptors. J Med Chem39:860-72 (1996) 
 
Gastrin/cholecystokinin type B receptor
Name:Gastrin/cholecystokinin type B receptor
Type:G Protein-Coupled Receptor (GPCR)
Mol. Mass.:48445.79
Organism:Homo sapiens (Human)
Description:Stable expression of human CCK-2 receptors in HEK 293 cells.
Residue:447
BDBM50049805
NameBDBM50049805
Synonyms:CHEMBL169703 Tifluadom
TypeSmall organic molecule
Emp. Form.C22H20FN3OS
Mol. Mass.393.477
SMILESCN1C(CNC(=O)c2ccsc2)CN=C(c2ccccc2F)c2ccccc12