Reaction Details
TargetTubulin beta chain
LigandBDBM50500399
Substrate/Competitorn/a
Meas. Tech.ChEMBL_1546324 (CHEMBL3748555)
IC50 3900±n/a nM
Citation Colley, HEMuthana, MDanson, SJJackson, LVBrett, MLHarrison, JCoole, SFMason, DPJennings, LRWong, MTulasi, VNorman, DLockey, PMWilliams, LDossetter, AGGriffen, EJThompson, MJ An Orally Bioavailable, Indole-3-glyoxylamide Based Series of Tubulin Polymerization Inhibitors Showing Tumor Growth Inhibition in a Mouse Xenograft Model of Head and Neck Cancer. J Med Chem58:9309-33 (2015) 
 
Tubulin beta chain
Name:Tubulin beta chain
Type:PROTEIN
Mol. Mass.:49840.26
Organism:Sus scrofa
Description:ChEMBL_105107
Residue:445
BDBM50500399
NameBDBM50500399
Synonyms:CHEMBL3746906
TypeSmall organic molecule
Emp. Form.C20H21N3O4
Mol. Mass.367.3984
SMILESCOCC(C)n1cc(C(=O)C(=O)Nc2ccc(OC)nc2)c2ccccc12