Reaction Details
TargetTubulin beta chain
LigandBDBM50500401
Substrate/Competitorn/a
Meas. Tech.ChEMBL_1546323 (CHEMBL3748554)
IC50 420±n/a nM
Citation Colley, HEMuthana, MDanson, SJJackson, LVBrett, MLHarrison, JCoole, SFMason, DPJennings, LRWong, MTulasi, VNorman, DLockey, PMWilliams, LDossetter, AGGriffen, EJThompson, MJ An Orally Bioavailable, Indole-3-glyoxylamide Based Series of Tubulin Polymerization Inhibitors Showing Tumor Growth Inhibition in a Mouse Xenograft Model of Head and Neck Cancer. J Med Chem58:9309-33 (2015) 
 
Tubulin beta chain
Name:Tubulin beta chain
Type:PROTEIN
Mol. Mass.:49840.26
Organism:Sus scrofa
Description:ChEMBL_105107
Residue:445
BDBM50500401
NameBDBM50500401
Synonyms:CHEMBL3746593
TypeSmall organic molecule
Emp. Form.C21H21N3O4
Mol. Mass.379.4091
SMILESCOc1ccc(NC(=O)C(=O)c2cn(CC3CCCO3)c3ccccc23)cn1