Reaction Details
TargetHistamine H3 receptor
LigandBDBM22884
Substrate/Competitorn/a
Meas. Tech.ChEMBL_83825 (CHEMBL691842)
Ki 40±n/a nM
Citation Stark, HPurand, KHüls, ALigneau, XGarbarg, MSchwartz, JCSchunack, W [125I]iodoproxyfan and related compounds: a reversible radioligand and novel classes of antagonists with high affinity and selectivity for the histamine H3 receptor. J Med Chem39:1220-6 (1996) 
 
Histamine H3 receptor
Name:Histamine H3 receptor
Type:G Protein-Coupled Receptor (GPCR)
Mol. Mass.:48607.98
Organism:Rattus norvegicus (rat)
Description:n/a
Residue:445
BDBM22884
NameBDBM22884
Synonyms:2-[3-(1H-imidazol-5-yl)propyl]-1-(2-{[(5-methyl-1H-imidazol-4-yl)methyl]sulfanyl}ethyl)guanidine Impromidine
TypeSmall organic molecule
Emp. Form.C14H23N7S
Mol. Mass.321.444
SMILESCc1nc[nH]c1CSCCN=C(N)NCCCc1cnc[nH]1