Reaction Details
TargetReverse transcriptase/RNaseH
LigandBDBM1517
Substrate/Competitorn/a
Meas. Tech.ChEMBL_195513 (CHEMBL800581)
IC50 10300±n/a nM
Citation Gussio, RPattabiraman, NZaharevitz, DWKellogg, GETopol, IARice, WGSchaeffer, CAErickson, JWBurt, SK All-atom models for the non-nucleoside binding site of HIV-1 reverse transcriptase complexed with inhibitors: a 3D QSAR approach. J Med Chem39:1645-50 (1996) 
 
Reverse transcriptase/RNaseH
Name:Reverse transcriptase/RNaseH
Type:PROTEIN
Mol. Mass.:65229.15
Organism:Human immunodeficiency virus 1
Description:ChEMBL_1473730
Residue:566
BDBM1517
NameBDBM1517
Synonyms:2-ethyl-7-methyl-2,4,9,15-tetraazatricyclo[9.4.0.0^{3,8}]pentadeca-1(11),3,5,7,12,14-hexaen-10-one Dipyridodiazepinone deriv. 2
TypeSmall organic molecule
Emp. Form.C14H14N4O
Mol. Mass.254.2872
SMILESCCN1c2nccc(C)c2NC(=O)c2cccnc12