Reaction Details
TargetfMet-Leu-Phe receptor
LigandBDBM50050932
Substrate/Competitorn/a
Meas. Tech.ChEMBL_216403 (CHEMBL820116)
IC50 2000±n/a nM
Citation Higgins, JDBridger, GJDerian, CKBeblavy, MJHernandez, PEGaul, FEAbrams, MJPike, MCSolomon, HF N-terminus urea-substituted chemotactic peptides: new potent agonists and antagonists toward the neutrophil fMLF receptor. J Med Chem39:1013-5 (1996) 
 
fMet-Leu-Phe receptor
Name:fMet-Leu-Phe receptor
Type:Enzyme Catalytic Domain
Mol. Mass.:38456.14
Organism:Homo sapiens (Human)
Description:gi_4503779
Residue:350
BDBM50050932
NameBDBM50050932
Synonyms:(S)-2-{(S)-4-Methyl-2-[(S)-4-methylsulfanyl-2-(3-propyl-ureido)-butyrylamino]-pentanoylamino}-3-phenyl-propionic acid | CHEMBL266448
TypeSmall organic molecule
Emp. Form.C24H38N4O5S
Mol. Mass.494.647
SMILESCCCNC(=O)N[C@@H](CCSC)C(=O)N[C@@H](CC(C)C)C(=O)N[C@@H](Cc1ccccc1)C(O)=O