Reaction Details
TargetfMet-Leu-Phe receptor
LigandBDBM50050939
Substrate/Competitorn/a
Meas. Tech.ChEMBL_88336 (CHEMBL696696)
EC50 900±n/a nM
Citation Higgins, JDBridger, GJDerian, CKBeblavy, MJHernandez, PEGaul, FEAbrams, MJPike, MCSolomon, HF N-terminus urea-substituted chemotactic peptides: new potent agonists and antagonists toward the neutrophil fMLF receptor. J Med Chem39:1013-5 (1996) 
 
fMet-Leu-Phe receptor
Name:fMet-Leu-Phe receptor
Type:Enzyme Catalytic Domain
Mol. Mass.:38456.14
Organism:Homo sapiens (Human)
Description:gi_4503779
Residue:350
BDBM50050939
NameBDBM50050939
Synonyms:(S)-2-{(S)-4-Methyl-2-[(S)-4-methylsulfanyl-2-(3-m-tolyl-ureido)-butyrylamino]-pentanoylamino}-3-phenyl-propionic acid | CHEMBL6997
TypeSmall organic molecule
Emp. Form.C28H38N4O5S
Mol. Mass.542.69
SMILESCSCC[C@H](NC(=O)Nc1cccc(C)c1)C(=O)N[C@@H](CC(C)C)C(=O)N[C@@H](Cc1ccccc1)C(O)=O