Reaction Details
TargetfMet-Leu-Phe receptor
LigandBDBM50050935
Substrate/Competitorn/a
Meas. Tech.ChEMBL_216403 (CHEMBL820116)
IC50 2±n/a nM
Citation Higgins, JDBridger, GJDerian, CKBeblavy, MJHernandez, PEGaul, FEAbrams, MJPike, MCSolomon, HF N-terminus urea-substituted chemotactic peptides: new potent agonists and antagonists toward the neutrophil fMLF receptor. J Med Chem39:1013-5 (1996) 
 
fMet-Leu-Phe receptor
Name:fMet-Leu-Phe receptor
Type:Enzyme Catalytic Domain
Mol. Mass.:38456.14
Organism:Homo sapiens (Human)
Description:gi_4503779
Residue:350
BDBM50050935
NameBDBM50050935
Synonyms:(S)-2-{(S)-4-Methyl-2-[(S)-4-methylsulfanyl-2-(3-p-tolyl-ureido)-butyrylamino]-pentanoylamino}-3-phenyl-propionic acid | CHEMBL266802
TypeSmall organic molecule
Emp. Form.C28H38N4O5S
Mol. Mass.542.69
SMILESCSCC[C@H](NC(=O)Nc1ccc(C)cc1)C(=O)N[C@@H](CC(C)C)C(=O)N[C@@H](Cc1ccccc1)C(O)=O