Reaction Details
TargetAcyl-CoA:cholesterol acyltransferase
LigandBDBM50051881
Substrate/Competitorn/a
Meas. Tech.ChEMBL_28783 (CHEMBL641693)
IC50 20±n/a nM
Citation Astles, PCAshton, MJBridge, AWHarris, NVHart, TWParrott, DPPorter, BRiddell, DSmith, CWilliams, RJ Acyl-CoA:Cholesterol O-acyltransferase (ACAT) inhibitors. 2. 2-(1,3-Dioxan-2-yl)-4,5-diphenyl-1H-imidazoles as potent inhibitors of ACAT. J Med Chem39:1423-32 (1996) 
 
Acyl-CoA:cholesterol acyltransferase
Name:Acyl-CoA:cholesterol acyltransferase
Synonyms:ACAT
Type:n/a
Mol. Mass.:35405.31
Organism:Oryctolagus cuniculus
Description:n/a
Residue:305
BDBM50051881
NameBDBM50051881
TypeSmall organic molecule
Emp. Form.C29H34N4O2
Mol. Mass.470.6059
SMILESCc1cc(C)n(CCCCC2(C)COC(OC2)c2nc(c([nH]2)-c2ccccc2)-c2ccccc2)n1