Reaction Details
TargetD(4) dopamine receptor
LigandBDBM50052186
Substrate/Competitorn/a
Meas. Tech.ChEMBL_60660 (CHEMBL671697)
Ki 1.3±n/a nM
Citation Ohmori, JMaeno, KHidaka, KNakato, KMatsumoto, MTada, SHattori, HSakamoto, STsukamoto, SUsuda, SMase, T Dopamine D3 and D4 receptor antagonists: synthesis and structure--activity relationships of (S)-(+)-N-(1-Benzyl-3-pyrrolidinyl)-5-chloro-4- [(cyclopropylcarbonyl) amino]-2-methoxybenzamide (YM-43611) and related compounds. J Med Chem39:2764-72 (1996) 
 
D(4) dopamine receptor
Name:D(4) dopamine receptor
Type:Enzyme
Mol. Mass.:48373.19
Organism:Homo sapiens (Human)
Description:P21917
Residue:419
BDBM50052186
NameBDBM50052186
Synonyms:4-Acryloylamino-N-((S)-1-benzyl-pyrrolidin-3-yl)-5-chloro-2-methoxy-benzamide | CHEMBL92192
TypeSmall organic molecule
Emp. Form.C22H24ClN3O3
Mol. Mass.413.897
SMILESCOc1cc(NC(=O)C=C)c(Cl)cc1C(=O)N[C@H]1CCN(Cc2ccccc2)C1